armnn-devenv/armnn/src/armnnTfParser/TfParser.cpp:21:48: fatal error: tensorflow/core/framework/graph.pb.h: No such file or directory

When I executed this command:

sudo ./build-armnn.sh

I met the following error:

Scanning dependencies of target armnnTfParser
[ 84%] Building CXX object CMakeFiles/armnnTfParser.dir/src/armnnTfParser/TfParser.cpp.o
/home/arm01/armnn-devenv/armnn/src/armnnTfParser/TfParser.cpp:21:48: fatal error: tensorflow/core/framework/graph.pb.h: No such file or directory
 #include "tensorflow/core/framework/graph.pb.h"
                                                ^
compilation terminated.
CMakeFiles/armnnTfParser.dir/build.make:62: recipe for target 'CMakeFiles/armnnTfParser.dir/src/armnnTfParser/TfParser.cpp.o' failed
make[2]: *** [CMakeFiles/armnnTfParser.dir/src/armnnTfParser/TfParser.cpp.o] Error 1
CMakeFiles/Makefile2:226: recipe for target 'CMakeFiles/armnnTfParser.dir/all' failed
make[1]: *** [CMakeFiles/armnnTfParser.dir/all] Error 2
Makefile:127: recipe for target 'all' failed
make: *** [all] Error 2
~/armnn-devenv

Could you help me?

More questions in this forum